{"text_format":"1","workbook":"xlsx","n_sheets":6,"sheets":["1.LISEZ-MOI","2.GRILLE DE RECUEIL","3.RAPPORT STANDARD","4.RAPPORT COURT","5. ANALYSE APPROFONDIE","listes déroulantes (masqué)"],"not_rendered":{"charts":15,"images":28,"macros":1,"external_links":1,"defined_names":5,"comments":0,"pivot_tables":0},"unopened":[],"bounds":{"document_bytes":16777216,"sheet_cells":100000,"rows_first":2000,"rows_last":500,"rows_between":2000,"halvings":0,"cell_chars":16384,"cell_head_chars":4096},"cells_cut":0,"cells_raw":0,"read":"whole","date_system":"1900"}

{"sheet":"1.LISEZ-MOI","index":0,"n_rows":47,"n_cols":6,"rows_kept":47,"cut":false,"hidden":false,"merged":[[6,0,7,1],[5,0,5,1],[36,4,37,4],[38,2,38,3],[39,2,39,3],[27,2,27,3],[28,2,28,3],[29,2,29,3],[30,2,30,3],[31,2,31,3],[33,2,33,3],[34,2,34,3],[35,2,35,3],[36,0,37,0],[36,1,37,1],[36,2,37,3],[0,0,1,1],[0,2,0,3],[1,2,1,3],[2,0,2,1],[2,2,2,4],[3,0,4,1],[3,3,3,4],[4,3,4,4],[41,2,41,3],[42,2,42,3],[8,0,8,1],[8,2,8,3],[20,2,20,3],[9,0,9,4],[10,2,10,3],[11,2,11,3],[12,2,12,3],[13,2,13,3],[14,0,14,4],[15,2,15,3],[5,2,7,4],[43,2,43,3],[44,2,44,3],[45,2,45,3],[46,2,46,3],[16,2,16,3],[17,2,17,3],[18,2,18,3],[19,2,19,3],[32,2,32,3],[21,2,21,3],[22,2,22,3],[23,2,23,3],[24,2,24,3],[25,2,25,3],[26,0,26,4],[40,0,40,4]]}
[null,null,"LISEZ-MOI Quick ÉVAL Antibio"]
[null,null,"MODALITÉS DE REMPLISSAGE DE LA GRILLE\nVersion Mai 2026"]
["OBJECTIF",null,"Evaluer la documentation et la pertinence des antibiothérapies prescrites en se basant sur le référentiel de l'établissement"]
["MÉTHODOLOGIE",null,"Critères d'inclusion :","Tout patient hospitalisé bénéficiant d'une antibiothérapie correspondant à une situation clinique incluse dans le référentiel de l'établissement de santé"]
[null,null,"Critères d'exclusion :","Situation clinique non incluse dans le référentiel de l'établissement de santé"]
[null,null,"Cette version de l'outil Quick ÉVAL Antibio est une version téléchargeable et à utiliser sur votre application de bureau \"Excel\".\nLors de l'ouverture du document, veillez à \"Activer le contenu\" et \"Activer les modifications\" dans le bandeau qui apparaît en haut de votre document. Si vous ne le faites pas, le fichier risque de perdre ses fonctionnalités.\n\nVeuillez vous référer au Guide méthodologique pour plus de détails."]
["IMPORTANT\nAVANT DE DÉMARRER"]
[]
["ITEM",null,"COMMENT RÉPONDRE ?",null,"IMPORTANCE"]
["GÉNÉRALITÉS"]
[1,"Type de service","Choisir dans le menu déroulant le type de service dans lequel est réalisé l'audit.",null,"conseillé"]
[2,"Service","Indiquer le service dans lequel est réalisé l'audit (texte libre).",null,"optionnel"]
[3,"Age du patient","Indiquer l'âge du patient (texte libre, nombres uniquement).\nSi une infection est votre unité d'évaluation, et que vous évaluez plusieurs infections d'un même patient, merci de ne remplir cette colonne qu'une seule fois par patient.",null,"optionnel"]
[4,"Sexe du patient","Indiquer le sexe du patient : masculin (M) ou féminin (F).\nSi une infection est votre unité d'évaluation, et que vous évaluez plusieurs infections d'un même patient, merci de ne remplir cette colonne qu'une seule fois par patient.",null,"obligatoire","Indispensable pour calculer le nombre de patients inclus et générer les rapports."]
["ÉVALUATION A J1"]
[5,"Indication de l'antibiothérapie tracée dans le dossier","Indiquer Oui si l'indication de l'antibiothérapie est tracée dans le dossier à J1 du début de l'antibiothérapie ou Non si l'indication n'est pas tracée dans le dossier à J1 du début de l'antibiothérapie.",null,"conseillé"]
[6,"Catégorie d'infection suspectée","Choisir dans le menu déroulant la catégorie d'infection suspectée (infection pulmonaire, cutanée, urinaire etc.).",null,"optionnel"]
[7,"Antibiotique prescrit","Choisir dans le menu déroulant la molécule antibiotique ou antifongique prescrite (en DCI).",null,"optionnel"]
[8,"Voie d'administration","Indiquer la voie d'administration choisie pour la molécule antibiotique utilisée : intra-veineuse (IV), per os (PO), sous-cutanée (SC), intra-musculaire (IM).",null,"optionnel"]
[9,"Si bi antibiothérapie : antibiotique associé","Choisir dans le menu déroulant la molécule antibiotique associée en cas de bi antibiothérapie (en DCI).",null,"optionnel"]
{"$rows_left_out":28}
{"sheet":"2.GRILLE DE RECUEIL","index":1,"n_rows":106,"n_cols":35,"rows_kept":106,"cut":false,"hidden":false,"merged":[[4,32,4,33],[0,9,1,12],[3,16,3,27],[3,28,3,34],[3,1,3,4],[3,5,3,15],[1,0,1,1]]}
[null,null,"Établissement :",null,"Nom de l'évaluateur :",null,"Nom du référentiel utilisé :",null,null,"Merci de compléter les champs ci-contre pour pré-remplir vos rapports automatisés."]
["Version Mai 2026",null,"Date de l'évaluation :",null,"Fonction de l'évaluateur :"]
[]
[null,"GÉNÉRALITÉS",null,null,null,"ÉVALUATION A J 1",null,null,null,null,null,null,null,null,null,null,"ÉVALUATION A J2  - J4",null,null,null,null,null,null,null,null,null,null,null,"ÉVALUATION COMPLÉMENTAIRE"]
[null,{"$f":"0+1","v":1},{"$f":"B5+1","v":2},3,4,5,6,7,8,9,10,11,12,13,14,15,16,17,18,19,20,21,22,23,24,25,26,27,28,29,{"$f":"AD5+1","v":30},{"$f":"AE5+1","v":31},32,null,{"$f":"AG5+1","v":33}]
[null,"Type de service","Service","Age du patient","Sexe du patient","Indication de l'antibiothérapie tracée dans le dossier","Catégorie d'infection suspectée","Antibiotique prescrit à J1","J1\nVoie d'administration","Si bi-antibiothérapie : antibiotique associé","J1\nVoie d'administration n°2","Si tri-antibiothérapie : antibiotique associé ","J1\nVoie d'administration n°3","Caractère utile ou non (indiqué ou non) de l'antibiothérapie, après évaluation de la démarche diagnostique","Choix des molécules antibiotiques approprié","Choix des voies d’administration approprié","Réévaluation tracée dans le dossier","Catégorie d'infection suspectée à J2-J4","Antibiotique prescrit à J2-J4","J2-J4\nVoie d'administration","Si bi-antibiothérapie : antibiotique associé ","J2-J4\nVoie d'administration n°2","Si tri-antibiothérapie : antibiotique associé","J2-J4\nVoie d'administration n°3","Caractère utile ou non (indiqué ou non) de la poursuite de l'antibiothérapie, après évaluation de la démarche diagnostique","J2-J4\nChoix des molécules antibiotiques approprié","J2-J4\nChoix des voies d’administration approprié","Durée prévue lors la réévaluation à J2-J4 appropriée","Analyse pharmaceutique réalisée","Intervention pharmaceutique réalisée en cas de prescription inappropriée","Intervention pharmaceutique acceptée","Date de début d'antibiothérapie\n(JJ/MM/AAAA)","Date de fin d'antibiothérapie\n(JJ/MM/AAAA)","Durée calculée en jours\nVerrouillé","Justification d'un traitement de plus de 7 jours"]
[1,null,null,null,null,null,null,null,null,null,null,null,null,null,null,null,null,null,null,null,null,null,null,null,null,null,null,null,null,null,null,null,null,{"$f":"DATEDIF(Tableau14[[#This Row],[Date de début d''antibiothérapie\n(JJ/MM/AAAA)]],Tableau14[[#This Row],[Date de fin d''antibiothérapie\n(JJ/MM/AAAA)]],\"d\")","v":0}]
[{"$f":"A7+1","v":2},null,null,null,null,null,null,null,null,null,null,null,null,null,null,null,null,null,null,null,null,null,null,null,null,null,null,null,null,null,null,null,null,{"$f":"DATEDIF(Tableau14[[#This Row],[Date de début d''antibiothérapie\n(JJ/MM/AAAA)]],Tableau14[[#This Row],[Date de fin d''antibiothérapie\n(JJ/MM/AAAA)]],\"d\")","v":0}]
[{"$f":"A8+1","v":3},null,null,null,null,null,null,null,null,null,null,null,null,null,null,null,null,null,null,null,null,null,null,null,null,null,null,null,null,null,null,null,null,{"$f":"DATEDIF(Tableau14[[#This Row],[Date de début d''antibiothérapie\n(JJ/MM/AAAA)]],Tableau14[[#This Row],[Date de fin d''antibiothérapie\n(JJ/MM/AAAA)]],\"d\")","v":0}]
[4,null,null,null,null,null,null,null,null,null,null,null,null,null,null,null,null,null,null,null,null,null,null,null,null,null,null,null,null,null,null,null,null,{"$f":"DATEDIF(Tableau14[[#This Row],[Date de début d''antibiothérapie\n(JJ/MM/AAAA)]],Tableau14[[#This Row],[Date de fin d''antibiothérapie\n(JJ/MM/AAAA)]],\"d\")","v":0}]
[5,null,null,null,null,null,null,null,null,null,null,null,null,null,null,null,null,null,null,null,null,null,null,null,null,null,null,null,null,null,null,null,null,{"$f":"DATEDIF(Tableau14[[#This Row],[Date de début d''antibiothérapie\n(JJ/MM/AAAA)]],Tableau14[[#This Row],[Date de fin d''antibiothérapie\n(JJ/MM/AAAA)]],\"d\")","v":0}]
[6,null,null,null,null,null,null,null,null,null,null,null,null,null,null,null,null,null,null,null,null,null,null,null,null,null,null,null,null,null,null,null,null,{"$f":"DATEDIF(Tableau14[[#This Row],[Date de début d''antibiothérapie\n(JJ/MM/AAAA)]],Tableau14[[#This Row],[Date de fin d''antibiothérapie\n(JJ/MM/AAAA)]],\"d\")","v":0}]
[7,null,null,null,null,null,null,null,null,null,null,null,null,null,null,null,null,null,null,null,null,null,null,null,null,null,null,null,null,null,null,null,null,{"$f":"DATEDIF(Tableau14[[#This Row],[Date de début d''antibiothérapie\n(JJ/MM/AAAA)]],Tableau14[[#This Row],[Date de fin d''antibiothérapie\n(JJ/MM/AAAA)]],\"d\")","v":0}]
[8,null,null,null,null,null,null,null,null,null,null,null,null,null,null,null,null,null,null,null,null,null,null,null,null,null,null,null,null,null,null,null,null,{"$f":"DATEDIF(Tableau14[[#This Row],[Date de début d''antibiothérapie\n(JJ/MM/AAAA)]],Tableau14[[#This Row],[Date de fin d''antibiothérapie\n(JJ/MM/AAAA)]],\"d\")","v":0}]
[9,null,null,null,null,null,null,null,null,null,null,null,null,null,null,null,null,null,null,null,null,null,null,null,null,null,null,null,null,null,null,null,null,{"$f":"DATEDIF(Tableau14[[#This Row],[Date de début d''antibiothérapie\n(JJ/MM/AAAA)]],Tableau14[[#This Row],[Date de fin d''antibiothérapie\n(JJ/MM/AAAA)]],\"d\")","v":0}]
[10,null,null,null,null,null,null,null,null,null,null,null,null,null,null,null,null,null,null,null,null,null,null,null,null,null,null,null,null,null,null,null,null,{"$f":"DATEDIF(Tableau14[[#This Row],[Date de début d''antibiothérapie\n(JJ/MM/AAAA)]],Tableau14[[#This Row],[Date de fin d''antibiothérapie\n(JJ/MM/AAAA)]],\"d\")","v":0}]
[11,null,null,null,null,null,null,null,null,null,null,null,null,null,null,null,null,null,null,null,null,null,null,null,null,null,null,null,null,null,null,null,null,{"$f":"DATEDIF(Tableau14[[#This Row],[Date de début d''antibiothérapie\n(JJ/MM/AAAA)]],Tableau14[[#This Row],[Date de fin d''antibiothérapie\n(JJ/MM/AAAA)]],\"d\")","v":0}]
[12,null,null,null,null,null,null,null,null,null,null,null,null,null,null,null,null,null,null,null,null,null,null,null,null,null,null,null,null,null,null,null,null,{"$f":"DATEDIF(Tableau14[[#This Row],[Date de début d''antibiothérapie\n(JJ/MM/AAAA)]],Tableau14[[#This Row],[Date de fin d''antibiothérapie\n(JJ/MM/AAAA)]],\"d\")","v":0}]
[13,null,null,null,null,null,null,null,null,null,null,null,null,null,null,null,null,null,null,null,null,null,null,null,null,null,null,null,null,null,null,null,null,{"$f":"DATEDIF(Tableau14[[#This Row],[Date de début d''antibiothérapie\n(JJ/MM/AAAA)]],Tableau14[[#This Row],[Date de fin d''antibiothérapie\n(JJ/MM/AAAA)]],\"d\")","v":0}]
[14,null,null,null,null,null,null,null,null,null,null,null,null,null,null,null,null,null,null,null,null,null,null,null,null,null,null,null,null,null,null,null,null,{"$f":"DATEDIF(Tableau14[[#This Row],[Date de début d''antibiothérapie\n(JJ/MM/AAAA)]],Tableau14[[#This Row],[Date de fin d''antibiothérapie\n(JJ/MM/AAAA)]],\"d\")","v":0}]
{"$rows_left_out":87}
{"sheet":"3.RAPPORT STANDARD","index":2,"n_rows":154,"n_cols":12,"rows_kept":154,"cut":false,"hidden":false,"merged":[[119,2,119,11],[120,2,120,11],[121,2,121,11],[124,10,124,11],[102,3,102,11],[98,2,98,5],[96,8,96,11],[98,8,98,11],[56,1,56,11],[100,2,100,11],[150,1,150,2],[125,2,125,9],[128,2,128,9],[144,1,145,5],[124,2,124,9],[147,1,147,2],[149,1,149,2],[146,3,147,3],[146,4,147,4],[148,1,148,2],[130,2,130,9],[135,2,135,9],[136,2,136,9],[129,2,129,9],[137,2,137,9],[138,2,138,9],[139,2,139,9],[13,7,13,8],[13,10,14,10],[14,7,14,8],[50,2,50,5],[52,2,52,5],[50,8,50,11],[52,8,52,11],[16,1,16,11],[126,10,126,11],[128,10,128,11],[127,10,127,11],[54,3,54,11],[116,1,116,3],[137,10,137,11],[96,2,96,5],[0,1,0,2],[1,1,1,2],[3,1,3,2],[0,3,1,7],[3,3,3,6],[5,1,5,11],[13,11,14,11],[10,1,10,2],[10,4,10,5],[9,7,9,8],[12,1,12,6],[13,5,13,6],[14,5,14,6],[12,7,12,11],[7,5,7,11],[10,7,10,8],[9,1,9,6],[3,9,3,10],[153,1,153,11],[154,1,161,11],[104,1,104,11],[118,1,118,11],[132,10,132,11],[123,1,123,11],[125,10,125,11],[126,2,126,9],[127,2,127,9],[151,8,151,9],[151,10,151,11],[141,2,141,9],[141,10,141,11],[137,1,141,1],[143,1,143,11],[140,2,140,9],[129,10,129,11],[130,1,136,1],[124,1,129,1],[136,10,136,11],[130,10,130,11],[133,2,133,9],[134,2,134,9],[131,2,131,9],[132,2,132,9],[131,10,131,11],[133,10,133,11],[134,10,134,11],[135,10,135,11],[138,10,138,11],[139,10,139,11]]}
[null,null,null,"RAPPORT STANDARD  \nDocumentation et pertinence de la prescription d'antibiothérapies par rapport au référentiel de l'établissement de santé"]
[]
[null," "]
[null,"Etablissement :",null,{"$f":"'2.GRILLE DE RECUEIL'!D1","v":0},null,null,null,null,"Date :",{"$f":"'2.GRILLE DE RECUEIL'!D2","v":"00:00:00"}]
[null," "]
[null,"TYPOLOGIE DES PATIENTS"]
[]
[null,{"$f":"COUNTIF('2.GRILLE DE RECUEIL'!$E:$E,\"M\")+COUNTIF('2.GRILLE DE RECUEIL'!$E:$E,\"F\")","v":0},"patients évalués",null,{"$f":"COUNTIF('2.GRILLE DE RECUEIL'!$F:$F,\"Oui\")+COUNTIF('2.GRILLE DE RECUEIL'!$F:$F,\"Non\")","v":0},"infections évaluées (possiblement ≠ du nombre de patients selon l'unité d'évaluation choisie)"]
[]
[null,"Nombre de lignes évaluées (patient ou infection) par type de service :",null,null,null,null,null,"Chirurgie :",null,{"$f":"COUNTIF('2.GRILLE DE RECUEIL'!$B:$B,\"Chirurgie\")","v":0},"Médecine :",{"$f":"COUNTIF('2.GRILLE DE RECUEIL'!$B:$B,\"Médecine\")","v":0}]
[null,"Réanimation :",null,{"$f":"COUNTIF('2.GRILLE DE RECUEIL'!$B:$B,\"Réanimation\")","v":0},"Urgences :",null,{"$f":"COUNTIF('2.GRILLE DE RECUEIL'!$B:$B,\"Urgences\")","v":0},"Onco-hématologie :",null,{"$f":"COUNTIF('2.GRILLE DE RECUEIL'!$B:$B,\"Onco-hématologie\")","v":0},"Autre :",{"$f":"COUNTIF('2.GRILLE DE RECUEIL'!$B:$B,\"Autre\")","v":0}]
[]
[null,"Sexe des patients",null,null,null,null,null,"Age des patients"]
[null,{"$f":"COUNTIF('2.GRILLE DE RECUEIL'!$E:$E,\"F\")","v":0},"femme(s)","soit",{"$f":"B14/B8","v":{"$error":"#DIV/0!"}},"des patients",null,"Mini :",null,{"$f":"MIN(Tableau14[Age du patient])","v":0},"Moyen :",{"$f":"AVERAGE(Tableau14[Age du patient])","v":{"$error":"#DIV/0!"}}]
[null,{"$f":"COUNTIF('2.GRILLE DE RECUEIL'!$E:$E,\"M\")","v":0},"homme(s)","soit",{"$f":"B15/B8","v":{"$error":"#DIV/0!"}},"des patients",null,"Maxi :",null,{"$f":"MAX(Tableau14[Age du patient])","v":0}]
[]
[null,"ÉVALUATION AU JOUR 1"]
[]
[]
[]
{"$rows_left_out":135}
{"sheet":"4.RAPPORT COURT","index":3,"n_rows":76,"n_cols":12,"rows_kept":76,"cut":false,"hidden":false,"merged":[[3,9,3,10],[30,8,30,11],[32,8,32,11],[34,8,34,11],[51,1,55,1],[48,1,48,3],[51,2,51,9],[51,10,51,11],[53,2,53,9],[53,10,53,11],[36,1,36,11],[50,1,50,11],[16,8,16,11],[18,8,18,11],[20,8,20,11],[22,8,22,11],[75,1,75,11],[72,1,72,2],[73,8,73,9],[73,10,73,11],[0,9,1,11],[71,1,71,2],[65,1,65,11],[66,1,67,5],[68,3,69,3],[68,4,69,4],[69,1,69,2],[70,1,70,2],[52,2,52,9],[52,10,52,11],[24,1,24,11],[28,8,28,11],[26,8,26,11],[0,1,0,2],[0,3,1,7],[1,1,1,2],[3,1,3,2],[3,3,3,6],[5,1,5,11],[10,1,10,2],[10,4,10,5],[14,1,14,11],[11,7,11,8],[11,10,12,10],[11,11,12,11],[12,7,12,8],[11,1,11,2],[11,4,11,5],[12,1,12,2],[12,4,12,5],[7,5,7,11],[9,1,9,6],[9,7,10,11],[59,2,59,9],[59,10,59,11],[57,2,57,9],[57,10,57,11],[58,2,58,9],[58,10,58,11],[76,1,81,11],[54,2,54,9],[54,10,54,11],[55,2,55,9],[55,10,55,11],[56,2,56,9],[56,10,56,11],[62,2,62,9],[63,2,63,9],[63,10,63,11],[62,1,63,1],[60,2,60,9],[60,10,60,11],[61,2,61,9],[61,10,61,11],[56,1,61,1]]}
[null,null,null,"RAPPORT COURT \n(champs conseillés uniquement)\nDocumentation et pertinence de la prescription d'antibiothérapies par rapport au référentiel de l'établissement de santé"]
[]
[null," "]
[null,"Etablissement :",null,{"$f":"'2.GRILLE DE RECUEIL'!D1","v":0},null,null,null,null,"Date :",{"$f":"'2.GRILLE DE RECUEIL'!D2","v":"00:00:00"}]
[null," "]
[null,"TYPOLOGIE DES PATIENTS"]
[]
[null,{"$f":"COUNTIF('2.GRILLE DE RECUEIL'!$E:$E,\"M\")+COUNTIF('2.GRILLE DE RECUEIL'!$E:$E,\"F\")","v":0},"patients évalués",null,{"$f":"COUNTIF('2.GRILLE DE RECUEIL'!$F:$F,\"Oui\")+COUNTIF('2.GRILLE DE RECUEIL'!$F:$F,\"Non\")","v":0},"infections évaluées (possiblement ≠ du nombre de patients selon l'unité d'évaluation choisie)"]
[]
[null,"Nombre de lignes évaluées (patient ou infection) par type de service :",null,null,null,null,null,"Age des patients"]
[null,"Réanimation :",null,{"$f":"COUNTIF('2.GRILLE DE RECUEIL'!$B:$B,\"Réanimation\")","v":0},"Urgences :",null,{"$f":"COUNTIF('2.GRILLE DE RECUEIL'!$B:$B,\"Urgences\")","v":0}]
[null,"Chirurgie :",null,{"$f":"COUNTIF('2.GRILLE DE RECUEIL'!$B:$B,\"Chirurgie\")","v":0},"Médecine :",null,{"$f":"COUNTIF('2.GRILLE DE RECUEIL'!$B:$B,\"Médecine\")","v":0},"Mini :",null,{"$f":"MIN(Tableau14[Age du patient])","v":0},"Moyen :",{"$f":"AVERAGE(Tableau14[Age du patient])","v":{"$error":"#DIV/0!"}}]
[null,"Onco-hématologie :",null,{"$f":"COUNTIF('2.GRILLE DE RECUEIL'!$B:$B,\"Onco-hématologie\")","v":0},"Autre :",null,{"$f":"COUNTIF('2.GRILLE DE RECUEIL'!$B:$B,\"Autre\")","v":0},"Maxi :",null,{"$f":"MAX(Tableau14[Age du patient])","v":0}]
[]
[null,"ÉVALUATION AU JOUR 1"]
[]
[null,null,null,null,null,null,null,{"$f":"'5. ANALYSE APPROFONDIE'!J178","v":{"$error":"#DIV/0!"}},"de prescriptions \"utiles\" après évaluation de la démarche diagnostique à J1"]
[null,null,null,null,null,null,null,"parmi les dossiers applicables"]
[null,null,null,null,null,null,null,{"$f":"'5. ANALYSE APPROFONDIE'!J184","v":{"$error":"#DIV/0!"}},"de prescriptions avec toutes les molécules appropriées à J1"]
[null,null,null,null,null,null,null,"parmi les dossiers applicables"]
{"$rows_left_out":57}
{"sheet":"5. ANALYSE APPROFONDIE","index":4,"n_rows":432,"n_cols":32,"rows_kept":432,"cut":false,"hidden":false,"merged":[[430,4,430,9],[431,2,431,9],[427,2,427,3],[427,5,427,6],[3,2,3,9],[418,3,418,5],[419,3,419,5],[418,6,419,8],[389,2,389,5],[401,2,401,5],[428,2,428,3],[429,2,429,3],[425,1,425,9],[400,2,400,5],[403,1,403,9],[412,2,412,3],[413,2,413,3],[406,2,406,5],[412,4,413,8],[409,1,409,9],[200,5,200,6],[200,8,200,9],[407,2,407,5],[373,1,373,9],[0,2,1,5],[206,1,206,9],[54,1,54,9],[176,8,176,9],[177,2,177,5],[183,2,183,5],[189,2,189,5],[176,2,176,3],[192,1,192,9],[180,1,180,9],[10,3,10,4],[11,3,11,4],[204,7,204,9],[203,7,203,9],[203,2,204,5],[169,5,172,8],[184,2,184,5],[200,2,200,3],[178,2,178,5],[174,1,174,9],[186,1,186,9],[198,1,198,9],[2,1,2,2],[2,3,2,9],[393,2,393,3],[393,5,393,6],[393,8,393,9],[394,2,394,4],[367,1,367,9],[201,6,202,8],[201,2,202,3],[201,4,201,5],[202,4,202,5],[208,6,208,9],[375,5,375,6],[375,8,375,9],[376,5,377,8],[376,2,376,4],[377,2,377,4],[203,1,204,1],[249,6,249,9],[387,5,387,6],[387,8,387,9],[247,1,247,9],[379,1,379,9],[369,2,369,3],[369,5,369,6],[381,8,381,9],[382,5,383,8],[382,2,382,4],[383,2,383,4],[190,2,190,5],[361,2,361,9],[196,2,196,4],[195,5,196,8],[392,2,392,9],[8,30,8,31],[8,25,8,27],[8,28,8,29],[10,6,11,6],[8,1,8,9],[10,5,11,5],[13,1,13,9],[169,4,172,4],[169,3,172,3],[10,7,11,8],[10,2,11,2],[167,1,167,9],[370,2,370,4],[371,2,371,4],[375,2,375,3],[360,1,360,9],[362,3,365,3],[362,4,365,4],[395,2,395,4],[394,5,395,8],[5,5,5,9],[6,4,6,9],[6,1,6,3],[15,6,15,9],[56,6,56,9],[176,5,176,6],[177,6,178,8],[182,2,182,3],[182,5,182,6],[182,8,182,9],[9,2,9,9],[175,2,175,9],[385,1,385,9],[362,5,365,8],[381,2,381,3],[381,5,381,6],[398,2,398,9],[181,2,181,9],[187,2,187,9],[199,2,199,9],[374,2,374,9],[380,2,380,9],[368,2,368,9],[386,2,386,9],[193,2,193,9],[194,2,194,3],[194,5,194,6],[194,8,194,9],[195,2,195,4],[388,6,389,8],[388,2,388,5],[397,1,397,9],[387,2,387,3],[183,6,184,8],[188,2,188,3],[188,5,188,6],[188,8,188,9],[189,6,190,8],[369,8,369,9],[370,5,371,8],[422,1,422,2],[423,1,423,2],[411,8,411,9],[428,4,429,8],[417,2,417,9],[410,2,410,9],[416,2,416,9],[404,2,404,9],[168,2,168,9],[426,2,426,9],[411,5,411,6],[411,2,411,3],[427,8,427,9],[399,2,399,3],[399,5,399,6],[399,8,399,9],[400,6,401,8],[405,2,405,3],[405,5,405,6],[405,8,405,9],[406,6,407,8],[415,1,415,9],[421,1,421,2],[391,1,391,9]]}
[null,null,"ANALYSE APPROFONDIE \n\nDocumentation et pertinence de la prescription d'antibiothérapies par rapport au référentiel de l'établissement de santé"]
[]
[null,"SOMMAIRE",null,"UTILISATION\n\nCet onglet est verrouillé. Vous ne pouvez pas le modifier. Il vous permet de consulter des données complémentaires à celles reportées dans les RAPPORT STANDARD et RAPPORT COURT. \n\n­ Veuillez le consulter après l'avoir actualisé en cliquant sur le bouton en haut à droite.\n¬ Utilisez le sommaire à gauche ou défilez vers le bas pour afficher les jeux de données.\n\n                             Indiquent le N° de la question."]
[null,null,"Pensez à vérifier que vos dénominateurs correspondent bien au nombre de lignes remplies, sinon, revérifiez votre grille de recueil. Le nombre de patients peut y être inférieur, car vous avez la possibilité de remplir plusieurs lignes par patient si vous souhaitez évaluer chaque antibiothérapie individuellement."]
[]
[null,{"$f":"COUNTIF('2.GRILLE DE RECUEIL'!$E:$E,\"M\")+COUNTIF('2.GRILLE DE RECUEIL'!$E:$E,\"F\")","v":0},"patients inclus*",null,{"$f":"COUNTIF('2.GRILLE DE RECUEIL'!$F:$F,\"Oui\")+COUNTIF('2.GRILLE DE RECUEIL'!$F:$F,\"Non\")","v":0},"infections évaluées** \n(possiblement ≠ du nombre de patients selon l'unité d'évaluation choisie)"]
[null,"* calculé à partir du nombre de réponses (homme ou femme) renseignées pour l'item N°4. ",null,null,"** calculé à partir du nombre de réponses renseignées pour l'item N°5."]
[]
[null,"Indication de l'antibiothérapie tracée",null,null,null,null,null,null,null,null,null,null,null,null,null,null,null,null,null,null,null,null,null,null,null,"Calcul de la proportion d'ATB administrés PO à J2-J4 (% affiché dans le rapport automatisé)",null,null,"Durée > 7 jours",null,"Parmi les traitements de plus de 7 jours, dossiers avec justification ttt > 7 jours"]
[null,null,"Nombre et taux de cas où l'indication de l'antibiothérapie est tracée dans le dossier patient.\n- Les dossiers applicables correspondent à ceux pour lesquels l'évaluateur a rempli \"Oui\" ou \"Non\" à l'item N°5.\n- Pas de dossier inapplicable."]
[null,{"$f":"COUNTIF('2.GRILLE DE RECUEIL'!$F:$F,\"Oui\")","v":0},"antibiothérapie(s) dont l'indication est","tracée dans le dossier",null,"parmi",{"$f":"COUNTIF('2.GRILLE DE RECUEIL'!$F:$F,\"Oui\")+COUNTIF('2.GRILLE DE RECUEIL'!$F:$F,\"Non\")","v":0},"dossier(s) applicable(s), soit",null,{"$f":"B11/G11","v":{"$error":"#DIV/0!"}},null,null,null,null,null,null,null,null,null,null,null,null,null,null,null,"Nombre d'antibiotiques administrés par voie PO à J2-J4","Nombre d'antibiotiques administrés par IV, SC ou IM à J2-J4","Total","Durée de traitement supérieure à 7 jours",{"$f":"COUNTIF(#REF!,\">7\")","v":{"$error":"#REF!"}},"Avec justification concernant la durée de traitement",{"$f":"COUNTIF('2.GRILLE DE RECUEIL'!#REF!,\"Oui\")/AD11","v":{"$error":"#REF!"}}]
[null,{"$f":"COUNTIF('2.GRILLE DE RECUEIL'!$F:$F,\"Non\")","v":0},null,"non-tracée dans le dossier",null,null,null,null,null,{"$f":"B12/G11","v":{"$error":"#DIV/0!"}},null,null,null,null,null,null,null,null,null,null,null,null,null,null,null,{"$f":"COUNTIF('2.GRILLE DE RECUEIL'!$T:$T,\"PO\")+COUNTIF('2.GRILLE DE RECUEIL'!$V:$V,\"PO\")+COUNTIF('2.GRILLE DE RECUEIL'!$X:$X,\"PO\")","v":0},{"$f":"COUNTIF('2.GRILLE DE RECUEIL'!$T:$T,\"IV\")+COUNTIF('2.GRILLE DE RECUEIL'!$V:$V,\"IV\")+COUNTIF('2.GRILLE DE RECUEIL'!$X:$X,\"IV\")+COUNTIF('2.GRILLE DE RECUEIL'!$T:$T,\"IM\")+COUNTIF('2.GRILLE DE RECUEIL'!$V:$V,\"IM\")+COUNTIF('2.GRILLE DE RECUEIL'!$X:$X,\"IM\")+COUNTIF('2.GRILLE DE RECUEIL'!$T:$T,\"SC\")+COUNTIF('2.GRILLE DE RECUEIL'!$V:$V,\"SC\")+COUNTIF('2.GRILLE DE RECUEIL'!$X:$X,\"SC\")","v":0},{"$f":"Z12+AA12","v":0},"Durée de traitement inférieure ou égale à 7 jours",{"$f":"COUNTIFS(#REF!,\"<=7\",#REF!,\"<>0\")","v":{"$error":"#REF!"}},"Sans justification concernant la durée de traitement",{"$f":"COUNTIF('2.GRILLE DE RECUEIL'!#REF!,\"Non\")/AD11","v":{"$error":"#REF!"}}]
[]
[null,"Catégorie d'infection suspectée"]
[]
[null,null,"Catégorie d'infection","Nombre d'infections",null,null,"Catégories d'infections renseignées et nombre associé, affichées par ordre décroissant si > 0."]
[null,null,"Abcès cérébral",{"$f":"COUNTIF(Tableau14[Catégorie d''infection suspectée], Tableau1[[#This Row],[Catégorie d''infection]])","v":0}]
[null,null,"Angines et pharyngites",{"$f":"COUNTIF(Tableau14[Catégorie d''infection suspectée], Tableau1[[#This Row],[Catégorie d''infection]])","v":0}]
[null,null,"Aucun foyer infectieux identifié",{"$f":"COUNTIF(Tableau14[Catégorie d''infection suspectée], Tableau1[[#This Row],[Catégorie d''infection]])","v":0}]
[null,null,"Autre infection",{"$f":"COUNTIF(Tableau14[Catégorie d''infection suspectée], Tableau1[[#This Row],[Catégorie d''infection]])","v":0}]
{"$rows_left_out":413}
{"sheet":"listes déroulantes (masqué)","index":5,"n_rows":243,"n_cols":4,"rows_kept":243,"cut":false,"hidden":true,"merged":[]}
[]
[]
[]
[]
[]
[]
[]
[]
[]
[]
[]
[]
[]
[]
[]
[]
[]
[]
[]
[]
{"$rows_left_out":223}